�s���{���R�[�h���͎s�撬���R�[�h,NO,�s���{����,�s�撬����,����,����_�J�i,����_�ʏ�,����_�p��,����������,���,�ꏊ����,�Z��,����,�ܓx,�o�x,�d�b�ԍ�,�����ԍ�,�����i���j,�����i�P�ʁj,�@�l�ԍ�,���L�ғ�,�������w���,���p�\�j��,�J�n����,�I������,���p�\�������L����,�摜,�摜_���C�Z���X,�T�v,�T�v_�p��,����,����_�p��,URL,���l
192074,0000000001,�R����,�B��s,���䉁���z��l�l������,�`���E�z�Z�M�~�Y�n�C���N�W���c���V���u���R,,,�s�w�蕶����,������,,�R�����B��s��⒬�{�v��,,,,,,,,,�B��s,1971-07-10,,,,,,,,,,,,
192074,0000000002,�R����,�B��s,�B��h�����̑����~,�j���T�L�V���N�S�E�V���E�m�N���U�V�L,,,�s�w�蕶����,������,,�R�����B��s���䒬�쉺��,,35.719648,138.443264,0551-22-1696,,,,,�B��s,1986-05-20,�ΐ��؁i�ߌ�j���y��,09:00,16:30,���T���j���y�іؗj���ߑO���i�j���̏ꍇ�͗����j�A�N���N�n�͗��p�s�B,,,,,,,,
192074,0000000003,�R����,�B��s,�B��̐���,�j���T�L�m�X�C�V��,,,�s�w�蕶����,������,,�R�����B��s���䒬�쉺��,,35.719648,138.443264,0551-22-1696,,,,,�B��s,1989-01-19,�ΐ��؁i�ߌ�j���y��,09:00,16:30,���T���j���y�іؗj���ߑO���i�j���̏ꍇ�͗����j�A�N���N�n�͗��p�s�B,,,,,,,,
192074,0000000004,�R����,�B��s,�c�~�R�䌩�_�Љ��{�{�a,�i�G�V�L�T���z�~�W���W���I�N�~���z���f��,,,�s�w�蕶����,������,,�R�����B��s�����㞊�슄,,35.674011,138.418069,,,,,,�䌩�_��,1993-06-23,,,,,,,,,,,,
192074,0000000005,�R����,�B��s,�萬������ɎO����,�K���W���E�W�A�~�_�T���]���]�E,,,�s�w�蕶����,���p�H�|�i,,�R�����B��s�_�R����R,,35.707645,138.435275,0551-22-3118,,,,,�萬��,1976-03-09,,,,,,,,,,,,
192074,0000000006,�R����,�B��s,��ώ��Λ�,�z�E�Z�L�W�Z�L�V���E,,,�s�w�蕶����,���p�H�|�i,,�R�����B��s��⒬�O�V��,,,,,,,,,��ώ�,1985-02-01,,,,,,,,,,,,
192074,0000000007,�R����,�B��s,��ΕS�ω��Α�,�C�b�Z�L�q���N�J���m���Z�L�]�E,,,�s�w�蕶����,���p�H�|�i,,�R�����B��s�_�R���k�{�n,,35.704494,138.420013,,,,,,���c�����{,1985-02-01,,,,,,,,,,,,
192074,0000000008,�R����,�B��s,�\��ʊω���F����,�W���E�C�`�����J���m���{�T�c�U�]�E,,,�s�w�蕶����,���p�H�|�i,,�R�����B��s��⒬�O�b��,,35.735322,138.487023,0551-22-0661,,,,,����@,1995-10-30,,,,,,,,,,,,
192074,0000000009,�R����,�B��s,�ؑ������͎m����,���N�]�E�R���S�E���L�V���c�]�E,,,�s�w�蕶����,���p�H�|�i,,�R�����B��s�����㞊�슄,,35.679237,138.436509,0551-22-0577,,,,,�����,2000-03-24,,,,,,,,,,,,
192074,0000000010,�R����,�B��s,���Z�Y�M����i�̑�ʎ�o ����262,�C�`�W���E���N���E�m�u�i�K�L�V���m�_�C�n���j���L���E�@�}�L�_�C262,,,�s�w�蕶����,���p�H�|�i,,�R�����B��s�_�R���k�{�n,,,,,,,,,�l,1979-03-23,,,,,,,,,,,,
192074,0000000011,�R����,�B��s,���Z�Y�M����i�̑�ʎ�o ����587,�C�`�W���E���N���E�m�u�i�K�L�V���m�_�C�n���j���L���E�@�}�L�_�C587,,,�s�w�蕶����,���p�H�|�i,,�R�����B��s�_�R���k�{�n,,,,,,,,,�l,1979-03-23,,,,,,,,,,,,
192074,0000000012,�R����,�B��s,���Z�Y�M����i�̑�ʎ�o ����205,�C�`�W���E���N���E�m�u�i�K�L�V���m�_�C�n���j���L���E�@�}�L�_�C205,,,�s�w�蕶����,���p�H�|�i,,�R�����B��s�呐���㞊����,,,,,,,,,�l,1979-03-23,,,,,,,,,,,,
192074,0000000013,�R����,�B��s,���Z�Y�M����i�̑�ʎ�o ����72,�C�`�W���E���N���E�m�u�i�K�L�V���m�_�C�n���j���L���E�@�}�L�_�C72,,,�s�w�蕶����,���p�H�|�i,,�R�����B��s�_�R����R,,35.707645,138.435275,0551-22-3118,,,,,�萬��,1979-03-23,,,,,,,,,,,,
192074,0000000014,�R����,�B��s,���Z�Y�M����i�̑�ʎ�o ����342,�C�`�W���E���N���E�m�u�i�K�L�V���m�_�C�n���j���L���E�@�}�L�_�C342,,,�s�w�蕶����,���p�H�|�i,,�R�����B��s�_�R���k�{�n,,,,,,,,,�l,1979-03-23,,,,,,,,,,,,
192074,0000000015,�R����,�B��s,�o��Z�����u�������v,�n�C�N�^���U�N�`���E�u�\�m�J���}�c�v,,,�s�w�蕶����,���p�H�|�i,,�R�����B��s�����㞊�슄,,,,,,,,,�l,1979-03-23,,,,,,,,,,,,
192074,0000000016,�R����,�B��s,�萬���̎R���z,�K���W���E�W�m�T���S�E�K�N,,,�s�w�蕶����,���p�H�|�i,,�R�����B��s�_�R����R,,35.707645,138.435275,0551-22-3118,,,,,�萬��,2000-03-24,,,,,,,,,,,,
192074,0000000017,�R����,�B��s,�򑠉@�̏��@,�^�N�]�E�C���m�J�l,,,�s�w�蕶����,���p�H�|�i,,�R�����B��s��⒬�O�b��,,35.733513,138.483197,,,,,,�򑠉@,1985-02-01,,,,,,,,,,,,
192074,0000000018,�R����,�B��s,���򎛂̏�,�~���E�W���E�W�m�J�l,,,�s�w�蕶����,���p�H�|�i,,�R�����B��s�~�쒬��~��,,35.766375,138.397323,0551-27-2021,,,,,����,1985-02-01,,,,,,,,,,,,
192074,0000000019,�R����,�B��s,������̏�,�_�C�R�E�W�m�J�l,,,�s�w�蕶����,���p�H�|�i,,�R�����B��s�����㞊�슄,,35.679237,138.436509,0551-22-0577,,,,,�����,1985-02-01,,,,,,,,,,,,
192074,0000000020,�R����,�B��s,�����}�q�{�����n,�c���N�T�Y�G�t�^�`�R�V���G,,,�s�w�蕶����,���p�H�|�i,,�R�����B��s���c������,,35.735833,138.425513,,,,,,�����_��,1993-06-23,,,,,,,,,,,,
192074,0000000021,�R����,�B��s,������؎����̕�,�W���E�R�E�W�A�I�L�V���L�_�C�m�n�J,,,�s�w�蕶����,���̑�,,�R�����B��s���N����,,35.724015,138.412896,0551-22-2014,,,,,�����,1976-03-09,,,,,,,,,,,,
192074,0000000022,�R����,�B��s,���c�M�`�ِ�,�^�P�_�m�u���V���J�^�A�g,,,�s�w�蕶����,���̑�,,�R�����B��s�_�R�����c,,,,,,,,,�l,1978-03-18,,,,,,,,,,,,
192074,0000000023,�R����,�B��s,���R���̕�,�A�i���}�V�m�n�J,,,�s�w�蕶����,���̑�,,�R�����B��s���R��,,35.767613,138.422354,0551-25-5485,,,,,������,1979-03-23,,,,,,,,,,,,
192074,0000000024,�R����,�B��s,�ؑ]���̕�,�L�\�V�m�n�J,,,�s�w�蕶����,���̑�,,�R�����B��s���䒬���,,35.731098,138.433783,0551-22-4357,,,,,������,1982-10-05,,,,,,,,,,,,
192074,0000000025,�R����,�B��s,���m�o���,�q�m�f�W���E�A�g,,,�s�w�蕶����,���̑�,,�R�����B��s��⒬���V��,,35.734977,138.453498,,,,,,�B��s,1991-04-01,,,,,,,,,,,,
192074,0000000026,�R����,�B��s,����,�J�K�~�C�V,,,�s�w�蕶����,���̑�,,�R�����B��s�{��,,35.702217,138.454982,,,,,,�P�{�_��,1989-01-19,,,,,,,,,,,,
192074,0000000027,�R����,�B��s,�萬���̌܏d��,�K���W���E�W�m�S�W���E�m�g�E,,,�s�w�蕶����,���̑�,,�R�����B��s�_�R����R,,35.707645,138.435275,0551-22-3118,,,,,�萬��,1989-01-19,,,,,,,,,,,,
192074,0000000028,�R����,�B��s,����@�Z�n����,�W�Q���C�����N�W�]�E,,,�s�w�蕶����,���̑�,,�R�����B��s��⒬�O�b��,,35.735322,138.487023,0551-22-0661,,,,,����@,1997-12-22,,,,,,,,,,,,
192074,0000000029,�R����,�B��s,�s�P�ٔV��,�R�E���J���m�q,,,�s�w�蕶����,���̑�,,�R�����B��s���䒬���,,,,,,,,,�l,2000-03-24,,,,,,,,,,,,
192074,0000000030,�R����,�B��s,���̉Ƃ̍�,�i�J�m�C�G�m�T�N��,,,�s�w�蕶����,���̑�,,�R�����B��s���N����,,,,,,,,,�l,1969-07-10,,,,,,,,,,,,
192074,0000000031,�R����,�B��s,���c�����{�����̎��p,�^�P�_�n�`�}���O�E�P�C�_�C�m�W���\�E,,,�s�w�蕶����,���̑�,,�R�����B��s�_�R���k�{�n,,35.704494,138.420013,,,,,,���c�����{,1969-07-10,,,,,,,,,,,,
192074,0000000032,�R����,�B��s,�������̃J��,�R�E�~���E�W�m�J��,,,�s�w�蕶����,���̑�,,�R�����B��s���䒬���,,35.731098,138.433783,0551-22-4357,,,,,������,1971-07-10,,,,,,,,,,,,
192074,0000000033,�R����,�B��s,�����Ƃ̒��N�}�L,�t�W�}�L�P�m�`���E�Z���}�L,,,�s�w�蕶����,���̑�,,�R�����B��s���N����,,,,,,,,,�l,1971-07-10,,,,,,,,,,,,
192074,0000000034,�R����,�B��s,�{�v�ۂ̃N�k�M,�~���N�{�m�N�k�M,,,�s�w�蕶����,���̑�,,�R�����B��s��⒬�{�v��,,,,,,,,,�l,1971-07-10,,,,,,,,,,,,
192074,0000000035,�R����,�B��s,����_�Ђ̃P���L,�J�b�e�W���W���m�P���L,,,�s�w�蕶����,���̑�,,�R�����B��s�≺,,35.708609,138.460612,,,,,,����_��,1971-07-10,,,,,,,,,,,,
192074,0000000036,�R����,�B��s,�c�~�R�̍���}�L,�i�G�V�L�T���m�R�E���}�L,,,�s�w�蕶����,���̑�,,�R�����B��s�����㞊�슄,,35.674011,138.418069,,,,,,�䌩�_��,1971-07-10,,,,,,,,,,,,
192074,0000000037,�R����,�B��s,�\�����̃}���W���E��,�ݼޭ�ĳ��Ƀ}���W���E�C�V,,,�s�w�蕶����,���̑�,,�R�����B��s��⒬�O�V��,,,,,,,,,�l,1979-03-23,,,,,,,,,,,,
192074,0000000038,�R����,�B��s,������E�݂̍��t���m,�J�}�i�V�K���E�K���m�^�J�V�R�]�E,,,�s�w�蕶����,���̑�,,�R����������E�݉͊ݒi�u,,,,,,,,,�@,1979-03-23,,,,,,,,,,,,
192074,0000000039,�R����,�B��s,���V��̑�i�V,�q�m�V���m�I�I�i�V,,,�s�w�蕶����,���̑�,,�R�����B��s��⒬���V��,,,,,,,,,�l,1982-10-05,,,,,,,,,,,,
192074,0000000040,�R����,�B��s,�k�{�n�̃T�J�L,�L�^�~���W�m�T�J�L,,,�s�w�蕶����,���̑�,,�R�����B��s�_�R���k�{�n,,,,,,,,,�l,1982-10-05,,,,,,,,,,,,
192074,0000000041,�R����,�B��s,���c�̃N�}�m�~�Y�L,�^�P�^�m�N�}�m�~�Y�L,,,�s�w�蕶����,���̑�,,�R�����B��s�_�R���k�{�n,,,,,,,,,�l,1982-10-05,,,,,,,,,,,,
192074,0000000042,�R����,�B��s,��ɒ˂̃T�N��,���j�d�J�m�T�N��,,,�s�w�蕶����,���̑�,,�R�����B��s�_�R�����c,,,,,,,,,���c�����{�E���c�n��E�k�{�n�n��,1989-01-19,,,,,,,,,,,,
192074,0000000043,�R����,�B��s,�����̃R�i��,�R�}�C�E�G�m�m�R�i��,,,�s�w�蕶����,���̑�,,�R�����B��s���䒬���,,,,,,,,,�l,1993-06-23,,,,,,,,,,,,
192074,0000000044,�R����,�B��s,�~��̋t�f�w,�c�u���C�m�M���N�_���\�E,,,�s�w�蕶����,���̑�,,�R�����B��s�~�쒬���~��,,,,,,,,,�l,1995-10-30,,,,,,,,,,,,
192074,0000000045,�R����,�B��s,�����R���w�Z�̂Ђ��炬,�L���E�A�i���}�V���E�K�b�R�E�m�q�C���M,,,�s�w�蕶����,���̑�,,�R�����B��s���R��,,35.755159,138.416887,,,,,,�B��s,1995-10-30,,,,,,,,,,,,
192074,0000000046,�R����,�B��s,��{�����{���D,���J�~���n�`�}���O�E���i�t�_,,,�s�w�蕶����,���̑�,,�R�����B��s��{,,35.714797,138.447857,0551-22-1727,,,,,��{�����{,1985-02-01,,,,,,,,,,,,
192074,0000000047,�R����,�B��s,�؋�,���N�W�L�u�c,,,�s�w�蕶����,���p�H�|�i,,�R�����B��s�����㞊����,,,,,,,,,�l,1992-01-28,,,,,,,,,,,,
192074,0000000048,�R����,�B��s,�؋�,���N�W�L�u�c,,,�s�w�蕶����,���p�H�|�i,,�R�����B��s���N���܋�,,,,,,,,,�l,1992-01-28,,,,,,,,,,,,
192074,0000000049,�R����,�B��s,���_�x��,�A���{�E�I�h��,,,�s�w�蕶����,���̑�,,�R�����B��s���×����w�Z,,35.687531,138.451198,0551-22-0483,,,,,�×����w�Z,1989-12-20,,,,,,,,,,,,
192074,0000000050,�R����,�B��s,�l�c��,���c�E�`,,,�s�w�蕶����,���̑�,,�R�����B��s���������,,35.729100 ,138.443557,,,,,,���������,1993-06-23,,,,,,,,,,,,
192074,0000000051,�R����,�B��s,�ג��_��,�^���g���W���W��,,,�s�w�蕶����,������,,�R�����B��s�_�R���k�{�n,,35.703381,138.419788,,,,,,�ג��_��,2004-10-06,,,,,,,,,,,,
192074,0000000052,�R����,�B��s,�ג���,�^���g���]�E,,,�s�w�蕶����,���p�H�|�i,,�R�����B��s�_�R���k�{�n,,35.703381,138.419788,,,,,,�ג��_��,2004-10-06,,,,,,,,,,,,
192074,0000000053,�R����,�B��s,�����ː_�Ж{�a,�g�E�}�g�W���W���z���f��,,,�s�w�蕶����,������,,�R�����B��s���䒬�k����,,35.729932,138.439652,,,,,,�����ː_��,2004-10-06,,,,,,,,,,,,
